Error C2054 Expected

RECOMMENDED: If you have Windows errors then we strongly recommend that you download and run this (Windows) Repair Tool.

에러메시지는 다름과 같습니다. resource.c d:myprojectlinuxlinux-2.6.8.1temp asmsystem.h(88) : error C2054: expected '(' to follow 'inline'.

Otherwise, generally do what the error message says: add one of -DADD_, or – DNOCHANGE, error C2054: expected '(' to follow 'inline'

2015年9月7日. error C2054: expected '(' to follow 'using' error C2061: syntax error : identifier ' using' c:program filesmicrosoft visual studio.

Zend Mail Error Sending email with Zend_Mail – Electric Toolbox – In this post I will look at how to send an emailusing the Zend Framework's Zend_Mail component. Search: Sending email with Zend_Mail.

Jun 16, 2015. peclibm_db2-1.9.7ibm_db2.c(471) : error C2054: expected '(' to follow 'rsrc '. peclibm_db2-1.9.7ibm_db2.c(497) : error C2143: syntax error.

c – unable to use inline in declaration get error C2054. – unable to use inline in declaration get error C2054. errors error C2054: expected '. not in formal parameter list error C2143:.

Thank you so much for posting the solution, it helped me compiling a Perl module with XS code in the same exact situation.

Error 1 error C2054: expected '(' to follow 'WINGDIAPI' c:. windows\v7.0a\include\gl\gl.h 1152 Error 6 error C2054:. some pixels with not quite the expected RGB.

LIBPNG: PNG reference library / Bugs / #239 CMake 'out-of-source. – Aug 19, 2015. syntax error : identifier 'PNG_LINKAGE_API' error C2054: expected '(' to follow ' PNG_LINKAGE_API' This same configuration worked with.

Error C2054: expected '(' to follow (identifier) – Errorbase – The function identifier is used in a context that requires trailing parentheses. This error also can be. }; // C2054, missing =

Compiler Errors C2001 through C2099 Compiler Error C2054. Compiler Error C2054. Compiler Error C2054. Compiler Error C2001. expected '(' to follow 'identifier'

Visual C++ Compiler Error C2054 Message Text expected '(' to follow ' identifier ' Circumstances. The only known case of this error is that the token immediately.

#error You should run hg revert SDL_config.h #endif. Error C2054 expected '(' to follow 'WINGDIAPI' headlessStubs C:Program Files.

Error Msimn.exe En Outlook Zend Mail Error Sending email with Zend_Mail – Electric Toolbox – In this post I will look at how to send an emailusing the Zend Framework's Zend_Mail component. Search: Sending

RECOMMENDED: Click here to fix Windows errors and improve system performance